Reply to topic

Error building libstreamanalyzer

davidnl
Registered Member
Posts
11
Karma
0

Error building libstreamanalyzer

Tue Nov 13, 2012 10:48 am
Hello,

I'm getting an error building libstreamanalyzer. It looks like the error is:
Code: Select all
ld: symbol(s) not found for architecture x86_64


This is the logfile and some additional info:
Code: Select all
bash-3.2$ uname -a
Darwin davids-macbookair.localdomain 12.2.0 Darwin Kernel Version 12.2.0: Sat Aug 25 00:48:52 PDT 2012; root:xnu-2050.18.24~1/RELEASE_X86_64 x86_64

bash-3.2$ port version
Version: 2.1.2

bash-3.2$ ./kdesrc-build --version
kdesrc-build 1.15.1

bash-3.2$ ./kdesrc-build --refresh-build kdesupport
 * Downloading projects.kde.org project database...
Script started processing at Tue Nov 13 10:04:22 2012
   Downloading KDE Project module metadata...
Updating kde-build-metadata (to branch master)
 * akonadi depends on kdesupport/soprano[master, but no module builds kdesupport/soprano[master for this run.
<<<  Build Process  >>>
Building libstreams (1/18)
   Waiting for source code update.
   No source update, but libstreams meets other building criteria.
   Source update complete for libstreams: no files affected
   Preparing build system for libstreams.
   Removing files in build directory for libstreams
   Old build system cleaned, starting new build system.
   Running cmake...
   Compiling...
   Build succeeded after 21 seconds.
   Installing libstreams
   Overall time for libstreams was 22 seconds.

Building libstreamanalyzer (2/18)
   Waiting for source code update.
   No source update, but libstreamanalyzer meets other building criteria.
   Source update complete for libstreamanalyzer: no files affected
   Preparing build system for libstreamanalyzer.
   Removing files in build directory for libstreamanalyzer
   Old build system cleaned, starting new build system.
   Running cmake...
   Compiling...

   Unable to build libstreamanalyzer!
   Took 33 seconds.
   Overall time for libstreamanalyzer was 33 seconds.

#removed some additional log lines here....

<<<  PACKAGES FAILED TO BUILD  >>>
libstreamanalyzer - ~/kde4/src/log/2012-11-13-03/libstreamanalyzer/build.log

#removed some additional log lines here....


bash-3.2$ cat ~/kde4/src/log/2012-11-13-03/libstreamanalyzer/build.log
# kdesrc-build running: '/opt/local/bin/gmake' '-j2'
# from directory: /Users/david/kde4/src/build/kdesupport/strigi/libstreamanalyzer
Scanning dependencies of target streamanalyzerstatic
[  2%] [  2%] Building CXX object lib/CMakeFiles/streamanalyzerstatic.dir/analyzerconfiguration.cpp.o
Building CXX object lib/CMakeFiles/streamanalyzerstatic.dir/analysisresult.cpp.o
[  2%] Building CXX object lib/CMakeFiles/streamanalyzerstatic.dir/analyzerloader.cpp.o
[  3%] Building CXX object lib/CMakeFiles/streamanalyzerstatic.dir/classproperties.cpp.o
[  4%] Building CXX object lib/CMakeFiles/streamanalyzerstatic.dir/diranalyzer.cpp.o
[  5%] Building CXX object lib/CMakeFiles/streamanalyzerstatic.dir/eventthroughanalyzer.cpp.o
[  5%] Building CXX object lib/CMakeFiles/streamanalyzerstatic.dir/fieldproperties.cpp.o
[  6%] Building CXX object lib/CMakeFiles/streamanalyzerstatic.dir/fieldpropertiesdb.cpp.o
[  7%] Building CXX object lib/CMakeFiles/streamanalyzerstatic.dir/fieldtypes.cpp.o
[  8%] Building CXX object lib/CMakeFiles/streamanalyzerstatic.dir/filelister.cpp.o
[  8%] Building CXX object lib/CMakeFiles/streamanalyzerstatic.dir/fnmatch.cpp.o
[  9%] Building CXX object lib/CMakeFiles/streamanalyzerstatic.dir/indexpluginloader.cpp.o
[ 10%] Building CXX object lib/CMakeFiles/streamanalyzerstatic.dir/lineeventanalyzer.cpp.o
[ 11%] Building CXX object lib/CMakeFiles/streamanalyzerstatic.dir/pdf/pdfparser.cpp.o
[ 11%] Building CXX object lib/CMakeFiles/streamanalyzerstatic.dir/query.cpp.o
[ 12%] Building CXX object lib/CMakeFiles/streamanalyzerstatic.dir/queryparser.cpp.o
[ 13%] Building CXX object lib/CMakeFiles/streamanalyzerstatic.dir/saxeventanalyzer.cpp.o
[ 14%] Building CXX object lib/CMakeFiles/streamanalyzerstatic.dir/streamanalyzer.cpp.o
[ 14%] Building CXX object lib/CMakeFiles/streamanalyzerstatic.dir/streamanalyzerfactory.cpp.o
[ 15%] Building CXX object lib/CMakeFiles/streamanalyzerstatic.dir/streamsaxanalyzer.cpp.o
[ 16%] Building CXX object lib/CMakeFiles/streamanalyzerstatic.dir/throughanalyzers/oggthroughanalyzer.cpp.o
[ 17%] Building CXX object lib/CMakeFiles/streamanalyzerstatic.dir/variant.cpp.o
[ 17%] Building CXX object lib/CMakeFiles/streamanalyzerstatic.dir/indexreader.cpp.o
[ 18%] Building CXX object lib/CMakeFiles/streamanalyzerstatic.dir/endanalyzers/arendanalyzer.cpp.o
[ 19%] Building CXX object lib/CMakeFiles/streamanalyzerstatic.dir/endanalyzers/bmpendanalyzer.cpp.o
[ 20%] Building CXX object lib/CMakeFiles/streamanalyzerstatic.dir/endanalyzers/bz2endanalyzer.cpp.o
[ 20%] Building CXX object lib/CMakeFiles/streamanalyzerstatic.dir/endanalyzers/cpioendanalyzer.cpp.o
[ 21%] Building CXX object lib/CMakeFiles/streamanalyzerstatic.dir/endanalyzers/flacendanalyzer.cpp.o
[ 22%] Building CXX object lib/CMakeFiles/streamanalyzerstatic.dir/endanalyzers/gzipendanalyzer.cpp.o
[ 23%] Building CXX object lib/CMakeFiles/streamanalyzerstatic.dir/endanalyzers/id3endanalyzer.cpp.o
[ 23%] Building CXX object lib/CMakeFiles/streamanalyzerstatic.dir/endanalyzers/lzmaendanalyzer.cpp.o
[ 24%] Building CXX object lib/CMakeFiles/streamanalyzerstatic.dir/endanalyzers/mailendanalyzer.cpp.o
[ 25%] Building CXX object lib/CMakeFiles/streamanalyzerstatic.dir/endanalyzers/mpegendanalyzer.cpp.o
[ 26%] Building CXX object lib/CMakeFiles/streamanalyzerstatic.dir/endanalyzers/odfendanalyzer.cpp.o
[ 26%] Building CXX object lib/CMakeFiles/streamanalyzerstatic.dir/endanalyzers/oleendanalyzer.cpp.o
[ 27%] Building CXX object lib/CMakeFiles/streamanalyzerstatic.dir/endanalyzers/pdfendanalyzer.cpp.o
[ 28%] Building CXX object lib/CMakeFiles/streamanalyzerstatic.dir/endanalyzers/pngendanalyzer.cpp.o
[ 29%] Building CXX object lib/CMakeFiles/streamanalyzerstatic.dir/endanalyzers/rpmendanalyzer.cpp.o
[ 29%] Building CXX object lib/CMakeFiles/streamanalyzerstatic.dir/endanalyzers/sdfendanalyzer.cpp.o
[ 30%] Building CXX object lib/CMakeFiles/streamanalyzerstatic.dir/endanalyzers/tarendanalyzer.cpp.o
[ 31%] Building CXX object lib/CMakeFiles/streamanalyzerstatic.dir/endanalyzers/textendanalyzer.cpp.o
[ 32%] Building CXX object lib/CMakeFiles/streamanalyzerstatic.dir/endanalyzers/zipendanalyzer.cpp.o
[ 32%] [ 33%] Building CXX object lib/CMakeFiles/streamanalyzerstatic.dir/endanalyzers/zipexeendanalyzer.cpp.o
Building CXX object lib/CMakeFiles/streamanalyzerstatic.dir/eventanalyzers/mimeeventanalyzer.cpp.o
[ 34%] Building CXX object lib/CMakeFiles/streamanalyzerstatic.dir/helperanalyzers/odfcontenthelperanalyzer.cpp.o
[ 35%] Building CXX object lib/CMakeFiles/streamanalyzerstatic.dir/helperanalyzers/odfmetahelperanalyzer.cpp.o
[ 35%] Building CXX object lib/CMakeFiles/streamanalyzerstatic.dir/helperanalyzers/saxhelperanalyzer.cpp.o
[ 36%] Building CXX object lib/CMakeFiles/streamanalyzerstatic.dir/lineanalyzers/m3ustreamanalyzer.cpp.o
[ 37%] Building CXX object lib/CMakeFiles/streamanalyzerstatic.dir/saxanalyzers/htmlsaxanalyzer.cpp.o
[ 38%] Building CXX object lib/CMakeFiles/streamanalyzerstatic.dir/xmlparser/libxmlstream.cpp.o
[ 38%] Building CXX object lib/CMakeFiles/streamanalyzerstatic.dir/xmlparser/xmlstream.cpp.o
[ 39%] Building CXX object lib/CMakeFiles/streamanalyzerstatic.dir/xesamparser.cpp.o
[ 40%] Building CXX object lib/CMakeFiles/streamanalyzerstatic.dir/compat.cpp.o
[ 41%] Building CXX object lib/CMakeFiles/streamanalyzerstatic.dir/endanalyzers/helperendanalyzer.cpp.o
/Users/david/kde4/src/kdesupport/strigi/libstreamanalyzer/lib/endanalyzers/helperendanalyzer.cpp:161:2: warning: this does not work on windows because processinputstream does not compile! [-W#warnings]
#warning this does not work on windows because processinputstream does not compile!
 ^
1 warning generated.
Linking CXX static library libstreamanalyzerstatic.a
/usr/bin/ranlib: file: libstreamanalyzerstatic.a(indexreader.cpp.o) has no symbols
/usr/bin/ranlib: file: libstreamanalyzerstatic.a(compat.cpp.o) has no symbols
/usr/bin/ranlib: file: libstreamanalyzerstatic.a(indexreader.cpp.o) has no symbols
/usr/bin/ranlib: file: libstreamanalyzerstatic.a(compat.cpp.o) has no symbols
[ 41%] Built target streamanalyzerstatic
Scanning dependencies of target streamanalyzer
[ 42%] [ 42%] Building CXX object lib/CMakeFiles/streamanalyzer.dir/analysisresult.cpp.o
Building CXX object lib/CMakeFiles/streamanalyzer.dir/analyzerconfiguration.cpp.o
[ 43%] Building CXX object lib/CMakeFiles/streamanalyzer.dir/analyzerloader.cpp.o
[ 44%] Building CXX object lib/CMakeFiles/streamanalyzer.dir/classproperties.cpp.o
[ 45%] Building CXX object lib/CMakeFiles/streamanalyzer.dir/diranalyzer.cpp.o
[ 45%] Building CXX object lib/CMakeFiles/streamanalyzer.dir/eventthroughanalyzer.cpp.o
[ 46%] Building CXX object lib/CMakeFiles/streamanalyzer.dir/fieldproperties.cpp.o
[ 47%] Building CXX object lib/CMakeFiles/streamanalyzer.dir/fieldpropertiesdb.cpp.o
[ 48%] Building CXX object lib/CMakeFiles/streamanalyzer.dir/fieldtypes.cpp.o
[ 48%] Building CXX object lib/CMakeFiles/streamanalyzer.dir/filelister.cpp.o
[ 49%] Building CXX object lib/CMakeFiles/streamanalyzer.dir/fnmatch.cpp.o
[ 50%] Building CXX object lib/CMakeFiles/streamanalyzer.dir/indexpluginloader.cpp.o
[ 51%] Building CXX object lib/CMakeFiles/streamanalyzer.dir/lineeventanalyzer.cpp.o
[ 51%] Building CXX object lib/CMakeFiles/streamanalyzer.dir/pdf/pdfparser.cpp.o
[ 52%] Building CXX object lib/CMakeFiles/streamanalyzer.dir/query.cpp.o
[ 53%] Building CXX object lib/CMakeFiles/streamanalyzer.dir/queryparser.cpp.o
[ 54%] Building CXX object lib/CMakeFiles/streamanalyzer.dir/saxeventanalyzer.cpp.o
[ 54%] Building CXX object lib/CMakeFiles/streamanalyzer.dir/streamanalyzer.cpp.o
[ 55%] Building CXX object lib/CMakeFiles/streamanalyzer.dir/streamanalyzerfactory.cpp.o
[ 56%] Building CXX object lib/CMakeFiles/streamanalyzer.dir/streamsaxanalyzer.cpp.o
[ 57%] Building CXX object lib/CMakeFiles/streamanalyzer.dir/throughanalyzers/oggthroughanalyzer.cpp.o
[ 57%] Building CXX object lib/CMakeFiles/streamanalyzer.dir/variant.cpp.o
[ 58%] Building CXX object lib/CMakeFiles/streamanalyzer.dir/indexreader.cpp.o
[ 59%] Building CXX object lib/CMakeFiles/streamanalyzer.dir/endanalyzers/arendanalyzer.cpp.o
[ 60%] Building CXX object lib/CMakeFiles/streamanalyzer.dir/endanalyzers/bmpendanalyzer.cpp.o
[ 60%] Building CXX object lib/CMakeFiles/streamanalyzer.dir/endanalyzers/bz2endanalyzer.cpp.o
[ 61%] Building CXX object lib/CMakeFiles/streamanalyzer.dir/endanalyzers/cpioendanalyzer.cpp.o
[ 62%] Building CXX object lib/CMakeFiles/streamanalyzer.dir/endanalyzers/flacendanalyzer.cpp.o
[ 63%] Building CXX object lib/CMakeFiles/streamanalyzer.dir/endanalyzers/gzipendanalyzer.cpp.o
[ 63%] Building CXX object lib/CMakeFiles/streamanalyzer.dir/endanalyzers/id3endanalyzer.cpp.o
[ 64%] Building CXX object lib/CMakeFiles/streamanalyzer.dir/endanalyzers/lzmaendanalyzer.cpp.o
[ 65%] Building CXX object lib/CMakeFiles/streamanalyzer.dir/endanalyzers/mailendanalyzer.cpp.o
[ 66%] Building CXX object lib/CMakeFiles/streamanalyzer.dir/endanalyzers/mpegendanalyzer.cpp.o
[ 66%] Building CXX object lib/CMakeFiles/streamanalyzer.dir/endanalyzers/odfendanalyzer.cpp.o
[ 67%] Building CXX object lib/CMakeFiles/streamanalyzer.dir/endanalyzers/oleendanalyzer.cpp.o
[ 68%] Building CXX object lib/CMakeFiles/streamanalyzer.dir/endanalyzers/pdfendanalyzer.cpp.o
[ 69%] Building CXX object lib/CMakeFiles/streamanalyzer.dir/endanalyzers/pngendanalyzer.cpp.o
[ 69%] Building CXX object lib/CMakeFiles/streamanalyzer.dir/endanalyzers/rpmendanalyzer.cpp.o
[ 70%] Building CXX object lib/CMakeFiles/streamanalyzer.dir/endanalyzers/sdfendanalyzer.cpp.o
[ 71%] Building CXX object lib/CMakeFiles/streamanalyzer.dir/endanalyzers/tarendanalyzer.cpp.o
[ 72%] Building CXX object lib/CMakeFiles/streamanalyzer.dir/endanalyzers/textendanalyzer.cpp.o
[ 72%] Building CXX object lib/CMakeFiles/streamanalyzer.dir/endanalyzers/zipendanalyzer.cpp.o
[ 73%] [ 74%] Building CXX object lib/CMakeFiles/streamanalyzer.dir/endanalyzers/zipexeendanalyzer.cpp.o
Building CXX object lib/CMakeFiles/streamanalyzer.dir/eventanalyzers/mimeeventanalyzer.cpp.o
[ 75%] Building CXX object lib/CMakeFiles/streamanalyzer.dir/helperanalyzers/odfcontenthelperanalyzer.cpp.o
[ 75%] Building CXX object lib/CMakeFiles/streamanalyzer.dir/helperanalyzers/odfmetahelperanalyzer.cpp.o
[ 76%] Building CXX object lib/CMakeFiles/streamanalyzer.dir/helperanalyzers/saxhelperanalyzer.cpp.o
[ 77%] Building CXX object lib/CMakeFiles/streamanalyzer.dir/lineanalyzers/m3ustreamanalyzer.cpp.o
[ 77%] Building CXX object lib/CMakeFiles/streamanalyzer.dir/saxanalyzers/htmlsaxanalyzer.cpp.o
[ 78%] Building CXX object lib/CMakeFiles/streamanalyzer.dir/xmlparser/libxmlstream.cpp.o
[ 79%] Building CXX object lib/CMakeFiles/streamanalyzer.dir/xmlparser/xmlstream.cpp.o
[ 80%] Building CXX object lib/CMakeFiles/streamanalyzer.dir/xesamparser.cpp.o
[ 80%] Building CXX object lib/CMakeFiles/streamanalyzer.dir/compat.cpp.o
[ 81%] Building CXX object lib/CMakeFiles/streamanalyzer.dir/endanalyzers/helperendanalyzer.cpp.o
/Users/david/kde4/src/kdesupport/strigi/libstreamanalyzer/lib/endanalyzers/helperendanalyzer.cpp:161:2: warning: this does not work on windows because processinputstream does not compile! [-W#warnings]
#warning this does not work on windows because processinputstream does not compile!
 ^
1 warning generated.
Linking CXX shared library libstreamanalyzer.dylib
Undefined symbols for architecture x86_64:
  "_libiconv", referenced from:
      Latin1Converter::_fromLatin1(char*&, char const*, unsigned long) in analysisresult.cpp.o
      Strigi::LineEventAnalyzer::initEncoding(std::string) in lineeventanalyzer.cpp.o
      Strigi::LineEventAnalyzer::handleData(char const*, unsigned int) in lineeventanalyzer.cpp.o
      UTF8Convertor::convert(char const*, unsigned long) in id3endanalyzer.cpp.o
      WordText::addText(char const*, unsigned long, void*) in oleendanalyzer.cpp.o
  "_libiconv_close", referenced from:
      Latin1Converter::~Latin1Converter() in analysisresult.cpp.o
      Strigi::LineEventAnalyzer::~LineEventAnalyzer() in lineeventanalyzer.cpp.o
      Strigi::LineEventAnalyzer::initEncoding(std::string) in lineeventanalyzer.cpp.o
      UTF8Convertor::~UTF8Convertor() in id3endanalyzer.cpp.o
      WordText::~WordText() in oleendanalyzer.cpp.o
  "_libiconv_open", referenced from:
      Latin1Converter::Latin1Converter() in analysisresult.cpp.o
      Strigi::LineEventAnalyzer::initEncoding(std::string) in lineeventanalyzer.cpp.o
      UTF8Convertor::UTF8Convertor(char const*) in id3endanalyzer.cpp.o
      WordText::WordText() in oleendanalyzer.cpp.o
ld: symbol(s) not found for architecture x86_64
clang: error: linker command failed with exit code 1 (use -v to see invocation)
gmake[2]: *** [lib/libstreamanalyzer.0.7.7.dylib] Error 1
gmake[1]: *** [lib/CMakeFiles/streamanalyzer.dir/all] Error 2
gmake: *** [all] Error 2
bash-3.2$



bash-3.2$ port installed
The following ports are currently installed:
  akonadi @1.8.0_1 (active)
  apple-gcc42 @5666.3_9 (active)
  aspell @0.60.6_4+nonls (active)
  aspell-dict-en @7.1_0 (active)
  atk @2.2.0_2 (active)
  attica @0.4.0_0 (active)
  autoconf @2.69_0 (active)
  automake @1.12.4_0 (active)
  automoc @0.9.88_4 (active)
  avahi @0.6.31_3+gtk+python27 (active)
  bison @2.6.4_0 (active)
  boost @1.52.0_0+no_single+no_static (active)
  bzip2 @1.0.6_0 (active)
  cairo @1.12.8_2+x11 (active)
  cctools @836_0+llvm31 (active)
  cctools-headers @836_0 (active)
  clucene @2.3.3.4_0 (active)
  cmake @2.8.9_1 (active)
  cppunit @1.12.1_0 (active)
  curl @7.28.0_0+ssl (active)
  curl-ca-bundle @7.28.0_1 (active)
  cyrus-sasl2 @2.1.25_3+kerberos (active)
  db46 @4.6.21_7 (active)
  dbus @1.4.20_1+startupitem (active)
  dbus-glib @0.100_0 (active)
  dbus-python27 @0.84.0_0 (active)
  dbusmenu-qt @0.9.0_0 (active)
  dialog @1.1-20120706_0 (active)
  dirac @1.0.2_1 (active)
  docbook-xml @5.0_2 (active)
  docbook-xml-4.1.2 @5.0_1 (active)
  docbook-xml-4.2 @5.0_1 (active)
  docbook-xml-4.3 @5.0_1 (active)
  docbook-xml-4.4 @5.0_1 (active)
  docbook-xml-4.5 @5.0_1 (active)
  docbook-xml-5.0 @5.0_1 (active)
  docbook-xsl @1.76.1_1 (active)
  docbook-xsl-ns @1.76.1_0 (active)
  dyld-headers @210.2.3_0 (active)
  eggdbus @0.6_1 (active)
  enchant @1.6.0_1 (active)
  exiv2 @0.23_0 (active)
  expat @2.1.0_0 (active)
  ffmpeg @1.0_2+gpl2 (active)
  fftw-3 @3.3.2_1 (active)
  flac @1.2.1_1 (active)
  flex @2.5.37_1 (active)
  fontconfig @2.9.0_1 (active)
  freetype @2.4.10_0 (active)
  gawk @4.0.1_0 (active)
  gcc_select @0.1_7 (active)
  gdbm @1.10_2 (active)
  gdk-pixbuf2 @2.26.4_0 (active)
  getopt @1.1.4_1 (active)
  gettext @0.18.1.1_2 (active)
  giflib @4.2.1_0+x11 (active)
  glib2 @2.34.1_0 (active)
  gmake @3.82_0 (active)
  gmp @5.0.5_0 (active)
  gnome-common @2.28.0_0 (active)
  gnome-doc-utils @0.20.10_0+python27 (active)
  gobject-introspection @1.32.1_4 (active)
  gperf @3.0.4_2 (active)
  grantlee @0.2.0_0 (active)
  gsed @4.2.1_2 (active)
  gtk-doc @1.18_0+python27 (active)
  gtk2 @2.24.13_0+x11 (active)
  help2man @1.40.10_0 (active)
  hicolor-icon-theme @0.12_0 (active)
  hunspell @1.3.2_0 (active)
  icu @49.1.2_0 (active)
  ilmbase @1.0.2_0 (active)
  intltool @0.50.2_0 (active)
  iso-codes @3.40_0 (active)
  jack @0.121.3_0 (active)
  jasper @1.900.1_9 (active)
  jbigkit @2.0_2 (active)
  jpeg @8d_0 (active)
  kde4-runtime @4.8.5_0 (active)
  kdelibs4 @4.8.5_0 (active)
  kdiff3 @0.9.97_0 (active)
  kerberos5 @1.7.2_0 (active)
  krusader @2.0.0_1 (active)
  lame @3.99.5_0 (active)
  lcms @1.19_2 (active)
  lcms2 @2.4_0 (active)
  ld64 @134.9_0+llvm31 (active)
  libart_lgpl @2.3.21_0 (active)
  libdaemon @0.14_0 (active)
  libedit @20120601-3.0_0 (active)
  libffi @3.0.11_1 (active)
  libglade2 @2.6.4_6 (active)
  libiconv @1.14_0 (active)
  libidn @1.25_0 (active)
  libiodbc @3.52.8_2 (active)
  libmng @1.0.10_2 (active)
  libmodplug @0.8.8.4_0 (active)
  libogg @1.3.0_1 (active)
  libopus @1.0.1_0 (active)
  libpixman @0.28.0_0 (active)
  libpng @1.5.13_0 (active)
  libsamplerate @0.1.8_0 (active)
  libsdl @1.2.15_0+x11 (active)
  libsndfile @1.0.25_0 (active)
  libssh @0.5.2_0 (active)
  libtheora @1.1.1_1 (active)
  libtool @2.4.2_3 (active)
  libunwind-headers @35.1_0 (active)
  libvorbis @1.3.3_0 (active)
  libvpx @1.1.0_0 (active)
  libxml2 @2.8.0_0 (active)
  libxslt @1.1.27_0 (active)
  llvm-3.1 @3.1_4 (active)
  llvm_select @0.2_0 (active)
  m4 @1.4.16_0 (active)
  md5deep @4.3_0 (active)
  mhash @0.9.9.9_0 (active)
  mpfr @3.1.1-p2_0 (active)
  mysql5 @5.1.66_1 (active)
  mysql5-server @5.1.66_1 (active)
  ncurses @5.9_1 (active)
  nosetests_select @0.1_0 (active)
  openexr @1.7.0_0 (active)
  openjpeg @1.5.0_3 (active)
  openslp @1.2.1_2 (active)
  openssl @1.0.1c_0 (active)
  orc @0.4.16_0 (active)
  oxygen-icons @4.8.5_0 (active)
  p5.12-getopt-long @2.380.0_3 (active)
  p5.12-locale-gettext @1.50.0_7 (active)
  p5.12-pathtools @3.330.0_3 (active)
  p5.12-scalar-list-utils @1.230.0_3 (active)
  p5.12-xml-parser @2.400.0_4 (active)
  p7zip @9.20.1_1 (active)
  pango @1.30.1_2+x11 (active)
  pcre @8.31_0 (active)
  perl5 @5.12.4_0+perl5_12 (active)
  perl5.12 @5.12.4_1 (active)
  phonon @4.6.0_0 (active)
  pkgconfig @0.27.1_1 (active)
  policykit @0.103_2 (active)
  polkit-qt @0.103.0_0 (active)
  py27-cairo @1.8.10_2 (active)
  py27-distribute @0.6.30_0 (active)
  py27-gdbm @2.7.3_0 (active)
  py27-gobject @2.26.0_3 (active)
  py27-gtk @2.22.0_3+x11 (active)
  py27-libxml2 @2.8.0_0 (active)
  py27-nose @1.2.1_0 (active)
  py27-numpy @1.6.2_0 (active)
  py27-py @1.1.1_0 (active)
  python27 @2.7.3_1 (active)
  python_select @0.3_1 (active)
  qca @2.0.3_0 (active)
  qimageblitz @0.0.6_0 (active)
  qjson @0.7.1_1 (active)
  qt4-mac @4.8.3_1+quartz (active)
  raptor2 @2.0.8_0 (active)
  rarian @0.8.1_0 (active)
  rasqal @0.9.29_0 (active)
  readline @6.2.000_0 (active)
  redland @1.0.15_0+db46 (active)
  schroedinger @1.0.11_0 (active)
  shared-desktop-ontologies @0.9.0_0 (active)
  shared-mime-info @1.0_0 (active)
  soprano @2.8.0_1 (active)
  speex @1.2rc1_0 (active)
  sqlite3 @3.7.14.1_0 (active)
  strigi @0.7.7_2 (active)
  texi2html @5.0_0 (active)
  texinfo @4.13_2 (active)
  tiff @3.9.5_0 (active)
  virtuoso @6.1.6_1 (active)
  x264 @20111210_0 (active)
  Xft2 @2.3.1_0 (active)
  xmlcatmgr @2.2_1 (active)
  xorg-bigreqsproto @1.1.2_0 (active)
  xorg-compositeproto @0.4.2_0 (active)
  xorg-damageproto @1.2.1_0 (active)
  xorg-fixesproto @5.0_0 (active)
  xorg-inputproto @2.2_0 (active)
  xorg-kbproto @1.0.6_0 (active)
  xorg-libice @1.0.8_0 (active)
  xorg-libpthread-stubs @0.3_0 (active)
  xorg-libsm @1.2.1_0 (active)
  xorg-libX11 @1.5.0_0 (active)
  xorg-libXau @1.0.7_0 (active)
  xorg-libxcb @1.8.1_2+python27 (active)
  xorg-libXcomposite @0.4.3_0 (active)
  xorg-libXcursor @1.1.13_0 (active)
  xorg-libXdamage @1.1.3_0 (active)
  xorg-libXdmcp @1.1.1_0 (active)
  xorg-libXext @1.3.1_0 (active)
  xorg-libXfixes @5.0_0 (active)
  xorg-libXi @1.6.1_0 (active)
  xorg-libXinerama @1.1.2_0 (active)
  xorg-libXrandr @1.3.2_0 (active)
  xorg-randrproto @1.4.0_0 (active)
  xorg-renderproto @0.11.1_0 (active)
  xorg-util-macros @1.17_0 (active)
  xorg-xcb-proto @1.7.1_0+python27 (active)
  xorg-xcb-util @0.3.9_0 (active)
  xorg-xcmiscproto @1.2.2_0 (active)
  xorg-xextproto @7.2.1_0 (active)
  xorg-xf86bigfontproto @1.2.0_0 (active)
  xorg-xineramaproto @1.2.1_0 (active)
  xorg-xproto @7.0.23_0 (active)
  xorg-xtrans @1.2.7_0 (active)
  xrender @0.9.7_0 (active)
  XviD @1.3.2_3 (active)
  xz @5.0.4_0 (active)
  yasm @1.2.0_0 (active)
  zlib @1.2.7_0 (active)
bash-3.2$



Please advise on how to get it to build, thanks!
davidnl
Registered Member
Posts
11
Karma
0

Re: Error building libstreamanalyzer

Tue Nov 13, 2012 12:04 pm
Problem solved... i had run "kdesrc-build-setup" with the default options to create the config file.

I deleted the config file, and used "kdesrc-buildrc-sample" instead, and now it works.

Why the default options are different from the sample file... i don't know :s
User avatar bcooksley
Administrator
Posts
18669
Karma
83
OS

Re: Error building libstreamanalyzer

Thu Nov 15, 2012 11:48 pm
Errors relating to iconv would definitely be very unusual, as iconv is provided by glibc.
Good to see you managed to fix it, although it would have been interesting to find out what the precise issue was.


System Settings and Device Actions KCM maintainer
Image
davidnl
Registered Member
Posts
11
Karma
0
Hi,

thanks for your reply. I will check if i can reproduce the error again by replacing the "bad" config file and i'll report back...

 
Reply to topic

Bookmarks



Who is online

Registered users: alake, Baidu [Spider], Bing [Bot], bjoernbalazs, braystacey, Dimitrios, edmael, einar, Exabot [Bot], flotho, Google [Bot], google01103, ivan, Joif, ken300, maarten, Majestic-12 [Bot], nezumi, peje, rdong, SecretCode, skywolfblue, stephans, Steve T, TheraHedwig, tienhung, Yahoo [Bot]