This forum has been archived. All content is frozen. Please use KDE Discuss instead.

MacOS High Sierra - failed build

Tags: skrooge skrooge skrooge
(comma "," separated)
samsc
Registered Member
Posts
2
Karma
0

MacOS High Sierra - failed build

Sun Aug 26, 2018 10:07 am
hi All,
I have tried to build Skrooge using macports on MacOS X on two different machines, with High Sierra.. both the cases failed after so many hours of trying this.
I am not also sure if Skrooge is the latest version in KDE package.
I had another clean machine and tried building Skrooge using macports again, and this time it completed, but there was no skrooge app!! just an app called panetry

anyway , now i am trying again. i am confused what is the best way of building this on mac os high sierra

here is an excerpt from the log:info:build SKGMainPanel::resetDefaultState() in skgmainpanel.cpp.o
:info:build SKGObjectModelBase::setData(QModelIndex const&, QVariant const&, int) in skgobjectmodelbase.cpp.o
:info:build SKGObjectModelBase::dropMimeData(QMimeData const*, Qt::DropAction, int, int, QModelIndex const&) in skgobjectmodelbase.cpp.o
:info:build SKGTabPage::overwrite(bool) in skgtabpage.cpp.o
:info:build SKGHtmlBoardWidget::dataModified(QString const&, int) in skghtmlboardwidget.cpp.o
:info:build ld: symbol(s) not found for architecture x86_64
:info:build clang: error: linker command failed with exit code 1 (use -v to see invocation)
:info:build make[2]: *** [lib/libskgbasegui.1.8.0.dylib] Error 1
:info:build make[2]: Leaving directory `/opt/local/var/macports/build/_opt_local_var_macports_sources_rsync.macports.org_macports_release_tarballs_ports_kde_skrooge/skrooge/work/build'
:info:build make[1]: *** [skgbasegui/CMakeFiles/skgbasegui.dir/all] Error 2
:info:build make[1]: Leaving directory `/opt/local/var/macports/build/_opt_local_var_macports_sources_rsync.macports.org_macports_release_tarballs_ports_kde_skrooge/skrooge/work/build'
:info:build make: *** [all] Error 2
:info:build make: Leaving directory `/opt/local/var/macports/build/_opt_local_var_macports_sources_rsync.macports.org_macports_release_tarballs_ports_kde_skrooge/skrooge/work/build'
:info:build Command failed: cd "/opt/local/var/macports/build/_opt_local_var_macports_sources_rsync.macports.org_macports_release_tarballs_ports_kde_skrooge/skrooge/work/build" && /usr/bin/make -j4 -w all VERBOSE=ON
:info:build Exit code: 2
:error:build Failed to build skrooge: command execution failed
:debug:build Error code: CHILDSTATUS 35717 2
:debug:build Backtrace: command execution failed
:debug:build while executing
:debug:build "system {*}$notty {*}$nice $fullcmdstring"
:debug:build invoked from within
:debug:build "command_exec build"
:debug:build (procedure "portbuild::build_main" line 8)
:debug:build invoked from within
:debug:build "$procedure $targetname"
:error:build See /opt/local/var/macports/logs/_opt_local_var_macports_sources_rsync.macports.org_macports_release_tarballs_ports_kde_skrooge/skrooge/main.log for details.
samsc
Registered Member
Posts
2
Karma
0
can anyone help ?
when building skrooge on mac for the 5th time !, i got an app called pinentry-mac.app , and it doesnt launch .
what is that ?


Bookmarks



Who is online

Registered users: bancha, Bing [Bot], Evergrowing, Google [Bot], mesutakcan, Sogou [Bot]