Reply to topic

Error building Marble files

rivera
Registered Member
Posts
1
Karma
0

Error building Marble files

Thu Apr 28, 2016 5:49 am
Hello y'all,

I have spent so many hours trying to install Marble's files following the steps in this link https://techbase.kde.org/Projects/Marbl ... sCompiling , but I keep getting this message error bellow when I am on step 5 (running make to build the program, mingw32-make). My laptops operating system is Windows 10, and I am compiling it using mingw32. Hopefully I will get a response before this Sunday (May 1, 2016).

[ 2%] Building CXX object src/lib/astro/CMakeFiles/astro.dir/astro_automoc.cpp.obj
[ 2%] Linking CXX shared library libastro.dll
CMakeFiles\astro.dir/objects.a(astrolib.cpp.obj):astrolib.cpp:(.text+0xadc): undefined reference to `_imp___ZN4Mat3C1Ed'
CMakeFiles\astro.dir/objects.a(astrolib.cpp.obj):astrolib.cpp:(.text+0xaf6): undefined reference to `_imp___ZN4Vec3C1Eddd'
CMakeFiles\astro.dir/objects.a(astrolib.cpp.obj):astrolib.cpp:(.text+0xb44): undefined reference to `_imp___ZN4Mat3aSERKS_'
CMakeFiles\astro.dir/objects.a(astrolib.cpp.obj):astrolib.cpp:(.text+0xb69): undefined reference to `_imp___ZN4Vec3aSERKS_'
CMakeFiles\astro.dir/objects.a(astrolib.cpp.obj):astrolib.cpp:(.text+0xbac): undefined reference to `_imp___ZN4Mat3C1Ed'
CMakeFiles\astro.dir/objects.a(astrolib.cpp.obj):astrolib.cpp:(.text+0xbc6): undefined reference to `_imp___ZN4Vec3C1Eddd'
CMakeFiles\astro.dir/objects.a(astrolib.cpp.obj):astrolib.cpp:(.text+0xc12): undefined reference to `_imp___ZN4Mat3aSERKS_'
CMakeFiles\astro.dir/objects.a(astrolib.cpp.obj):astrolib.cpp:(.text+0xc37): undefined reference to `_imp___ZN4Vec3aSERKS_'
CMakeFiles\astro.dir/objects.a(astrolib.cpp.obj):astrolib.cpp:(.text+0xc5c): undefined reference to `_imp___ZN4Mat3C1Ed'
CMakeFiles\astro.dir/objects.a(astrolib.cpp.obj):astrolib.cpp:(.text+0xd65): undefined reference to `_imp___ZN4Mat3aSERKS_'
CMakeFiles\astro.dir/objects.a(astrolib.cpp.obj):astrolib.cpp:(.text+0xe3c): undefined reference to `_imp___ZN4Mat3C1Ed'
CMakeFiles\astro.dir/objects.a(astrolib.cpp.obj):astrolib.cpp:(.text+0xf2f): undefined reference to `_imp___ZN4Mat3aSERKS_'
CMakeFiles\astro.dir/objects.a(astrolib.cpp.obj):astrolib.cpp:(.text+0x106e): undefined reference to `_imp___ZN4Mat3C1Ed'
CMakeFiles\astro.dir/objects.a(astrolib.cpp.obj):astrolib.cpp:(.text+0x1556): undefined reference to `_imp___ZN4Mat3aSERKS_'
CMakeFiles\astro.dir/objects.a(astrolib.cpp.obj):astrolib.cpp:(.text+0x158b): undefined reference to `_imp___ZN4Mat3mLERKS_'
CMakeFiles\astro.dir/objects.a(astrolib.cpp.obj):astrolib.cpp:(.text+0x17cc): undefined reference to `_imp___ZN4Mat3C1Ed'
CMakeFiles\astro.dir/objects.a(astrolib.cpp.obj):astrolib.cpp:(.text+0x1a47): undefined reference to `_imp___ZN4Mat3aSERKS_'
CMakeFiles\astro.dir/objects.a(astrolib.cpp.obj):astrolib.cpp:(.text+0x1bde): undefined reference to `_imp___ZN4Mat3C1Ed'
CMakeFiles\astro.dir/objects.a(astrolib.cpp.obj):astrolib.cpp:(.text+0x1c30): undefined reference to `_imp___ZN4Mat36assignEddddddddd'
CMakeFiles\astro.dir/objects.a(astrolib.cpp.obj):astrolib.cpp:(.text+0x1c68): undefined reference to `_imp___ZN4Vec3C1Eddd'
CMakeFiles\astro.dir/objects.a(astrolib.cpp.obj):astrolib.cpp:(.text+0x1cbe): undefined reference to `_imp___ZN4Vec3ixEj'
CMakeFiles\astro.dir/objects.a(astrolib.cpp.obj):astrolib.cpp:(.text+0x1ddc): undefined reference to `_imp___ZN4Vec3C1Eddd'
CMakeFiles\astro.dir/objects.a(astrolib.cpp.obj):astrolib.cpp:(.text+0x1e30): undefined reference to `_imp___ZN4Vec3ixEj'
CMakeFiles\astro.dir/objects.a(astrolib.cpp.obj):astrolib.cpp:(.text+0x201c): undefined reference to `_imp___ZN4Mat3C1Ed'
CMakeFiles\astro.dir/objects.a(astrolib.cpp.obj):astrolib.cpp:(.text+0x20a4): undefined reference to `_imp___ZN4Vec3C1Eddd'
CMakeFiles\astro.dir/objects.a(astrolib.cpp.obj):astrolib.cpp:(.text+0x20f2): undefined reference to `_imp___ZN4Vec3ixEj'
CMakeFiles\astro.dir/objects.a(astrolib.cpp.obj):astrolib.cpp:(.text+0x21be): undefined reference to `_imp___ZN4Vec3aSERKS_'
CMakeFiles\astro.dir/objects.a(astrolib.cpp.obj):astrolib.cpp:(.text+0x21c4): undefined reference to `_imp___ZN4Mat3aSERKS_'
CMakeFiles\astro.dir/objects.a(astrolib.cpp.obj):astrolib.cpp:(.text+0x2338): undefined reference to `_imp___ZN4Mat36assignEddddddddd'
CMakeFiles\astro.dir/objects.a(astrolib.cpp.obj):astrolib.cpp:(.text+0x2359): undefined reference to `_imp___ZN4Mat3aSERKS_'
CMakeFiles\astro.dir/objects.a(astrolib.cpp.obj):astrolib.cpp:(.text+0x2373): undefined reference to `_imp___ZN4Vec3aSERKS_'
CMakeFiles\astro.dir/objects.a(astrolib.cpp.obj):astrolib.cpp:(.text+0x2452): undefined reference to `_imp___ZN4Vec3C1Eddd'
CMakeFiles\astro.dir/objects.a(astrolib.cpp.obj):astrolib.cpp:(.text+0x2468): undefined reference to `_imp___ZN4Mat3C1Ed'
CMakeFiles\astro.dir/objects.a(astrolib.cpp.obj):astrolib.cpp:(.text+0x2549): undefined reference to `_imp___ZN4Mat3aSERKS_'
CMakeFiles\astro.dir/objects.a(astrolib.cpp.obj):astrolib.cpp:(.text+0x2576): undefined reference to `_imp___ZN4Vec3aSERKS_'
CMakeFiles\astro.dir/objects.a(astrolib.cpp.obj):astrolib.cpp:(.text+0x2692): undefined reference to `_imp___ZN4Vec3C1Eddd'
CMakeFiles\astro.dir/objects.a(astrolib.cpp.obj):astrolib.cpp:(.text+0x26a8): undefined reference to `_imp___ZN4Mat3C1Ed'
CMakeFiles\astro.dir/objects.a(astrolib.cpp.obj):astrolib.cpp:(.text+0x26d3): undefined reference to `_imp___ZN4Mat3aSERKS_'
CMakeFiles\astro.dir/objects.a(astrolib.cpp.obj):astrolib.cpp:(.text+0x26f4): undefined reference to `_imp___ZN4Vec3aSERKS_'
CMakeFiles\astro.dir/objects.a(astrolib.cpp.obj):astrolib.cpp:(.text+0x28cd): undefined reference to `_imp___ZN4Vec3C1Eddd'
CMakeFiles\astro.dir/objects.a(astrolib.cpp.obj):astrolib.cpp:(.text+0x28ea): undefined reference to `_imp___ZN4Vec3aSERKS_'
CMakeFiles\astro.dir/objects.a(astrolib.cpp.obj):astrolib.cpp:(.text+0x2908): undefined reference to `_imp___ZN4Vec3C1ERKS_'
CMakeFiles\astro.dir/objects.a(astrolib.cpp.obj):astrolib.cpp:(.text+0x295d): undefined reference to `_imp___ZN4Vec3ixEj'
CMakeFiles\astro.dir/objects.a(astrolib.cpp.obj):astrolib.cpp:(.text+0x2a15): undefined reference to `_imp___ZN4Vec3aSERKS_'
CMakeFiles\astro.dir/objects.a(astrolib.cpp.obj):astrolib.cpp:(.text+0x2a91): undefined reference to `_imp___ZN4Vec3C1Eddd'
CMakeFiles\astro.dir/objects.a(astrolib.cpp.obj):astrolib.cpp:(.text+0x2a9a): undefined reference to `_imp___ZN4Vec3ixEj'
CMakeFiles\astro.dir/objects.a(astrolib.cpp.obj):astrolib.cpp:(.text+0x2af3): undefined reference to `_imp___ZN4Vec3aSERKS_'
CMakeFiles\astro.dir/objects.a(astrolib.cpp.obj):astrolib.cpp:(.text+0x2b13): undefined reference to `_imp___ZN4Vec3C1ERKS_'
CMakeFiles\astro.dir/objects.a(astrolib.cpp.obj):astrolib.cpp:(.text+0x3040): undefined reference to `_imp___ZN4Vec36assignEddd'
CMakeFiles\astro.dir/objects.a(astrolib.cpp.obj):astrolib.cpp:(.text+0x324b): undefined reference to `_imp___ZN4Vec36assignEddd'
CMakeFiles\astro.dir/objects.a(astrolib.cpp.obj):astrolib.cpp:(.text+0x36b6): undefined reference to `_imp___ZN4Vec36assignEddd'
CMakeFiles\astro.dir/objects.a(astrolib.cpp.obj):astrolib.cpp:(.text+0x375a): undefined reference to `_imp___ZN4Vec36assignEddd'
CMakeFiles\astro.dir/objects.a(astrolib.cpp.obj):astrolib.cpp:(.text+0x388c): undefined reference to `_imp___ZN4Mat3C1Ed'
CMakeFiles\astro.dir/objects.a(astrolib.cpp.obj):astrolib.cpp:(.text+0x39e3): undefined reference to `_imp___ZN4Mat3aSERKS_'
CMakeFiles\astro.dir/objects.a(astrolib.cpp.obj):astrolib.cpp:(.text+0x3a14): undefined reference to `_imp___ZN4Mat3mLERKS_'
CMakeFiles\astro.dir/objects.a(astrolib.cpp.obj):astrolib.cpp:(.text+0x3a71): undefined reference to `_imp___ZN4Vec3aSERKS_'
CMakeFiles\astro.dir/objects.a(astrolib.cpp.obj):astrolib.cpp:(.text+0x3bd7): undefined reference to `_imp___ZN4Vec3C1Eddd'
CMakeFiles\astro.dir/objects.a(astrolib.cpp.obj):astrolib.cpp:(.text+0x3c3c): undefined reference to `_imp___ZN4Vec3aSERKS_'
CMakeFiles\astro.dir/objects.a(astrolib.cpp.obj):astrolib.cpp:(.text+0x3c57): undefined reference to `_imp___ZN4Vec3ixEj'
CMakeFiles\astro.dir/objects.a(astrolib.cpp.obj):astrolib.cpp:(.text+0x3c9a): undefined reference to `_imp___Z6atan20dd'
CMakeFiles\astro.dir/objects.a(astrolib.cpp.obj):astrolib.cpp:(.text+0x4493): undefined reference to `_imp___ZN4Vec3C1Eddd'
CMakeFiles\astro.dir/objects.a(astrolib.cpp.obj):astrolib.cpp:(.text+0x4574): undefined reference to `_imp___ZN4Vec3ixEj'
CMakeFiles\astro.dir/objects.a(astrolib.cpp.obj):astrolib.cpp:(.text+0x6831): undefined reference to `_imp___ZN4Vec3ixEj'
CMakeFiles\astro.dir/objects.a(astrolib.cpp.obj):astrolib.cpp:(.text+0x6c6a): undefined reference to `_imp___ZN4Vec3C1Eddd'
CMakeFiles\astro.dir/objects.a(astrolib.cpp.obj):astrolib.cpp:(.text+0xae90): undefined reference to `_imp___ZN4Vec3C1Eddd'
CMakeFiles\astro.dir/objects.a(astrolib.cpp.obj):astrolib.cpp:(.text+0xb32e): undefined reference to `_imp___ZN4Vec36assignEddd'
CMakeFiles\astro.dir/objects.a(astrolib.cpp.obj):astrolib.cpp:(.text+0xb34c): undefined reference to `_imp___ZN4Vec3aSERKS_'
CMakeFiles\astro.dir/objects.a(astrolib.cpp.obj):astrolib.cpp:(.text+0xb525): undefined reference to `_imp___ZN4Vec3C1Eddd'
CMakeFiles\astro.dir/objects.a(astrolib.cpp.obj):astrolib.cpp:(.text+0xb59b): undefined reference to `_imp___ZN4Vec36assignEddd'
CMakeFiles\astro.dir/objects.a(astrolib.cpp.obj):astrolib.cpp:(.text+0xb62d): undefined reference to `_imp___ZN4Mat3C1Ed'
CMakeFiles\astro.dir/objects.a(astrolib.cpp.obj):astrolib.cpp:(.text+0xb662): undefined reference to `_imp___ZN4Vec3C1Eddd'
CMakeFiles\astro.dir/objects.a(astrolib.cpp.obj):astrolib.cpp:(.text+0xb6f3): undefined reference to `_imp___ZN4Vec3aSERKS_'
CMakeFiles\astro.dir/objects.a(astrolib.cpp.obj):astrolib.cpp:(.text+0xb7b7): undefined reference to `_imp___ZN4Mat3aSERKS_'
CMakeFiles\astro.dir/objects.a(astrolib.cpp.obj):astrolib.cpp:(.text+0xbc0d): undefined reference to `_imp___ZN4Mat3mLERKS_'
CMakeFiles\astro.dir/objects.a(astrolib.cpp.obj):astrolib.cpp:(.text+0xbce8): undefined reference to `_imp___ZN4Vec3mLEd'
CMakeFiles\astro.dir/objects.a(astrolib.cpp.obj):astrolib.cpp:(.text+0xbe55): undefined reference to `_imp___ZN4Vec3C1Eddd'
CMakeFiles\astro.dir/objects.a(astrolib.cpp.obj):astrolib.cpp:(.text+0xbe7d): undefined reference to `_imp___ZN4Vec3ixEj'
CMakeFiles\astro.dir/objects.a(astrolib.cpp.obj):astrolib.cpp:(.text+0xbecc): undefined reference to `_imp___ZN4Vec36assignEddd'
CMakeFiles\astro.dir/objects.a(astrolib.cpp.obj):astrolib.cpp:(.text+0xbf0a): undefined reference to `_imp___ZN4Vec3aSERKS_'
CMakeFiles\astro.dir/objects.a(astrolib.cpp.obj):astrolib.cpp:(.text+0xc48f): undefined reference to `_imp___ZN4Vec3C1Eddd'
CMakeFiles\astro.dir/objects.a(astrolib.cpp.obj):astrolib.cpp:(.text+0xc4bb): undefined reference to `_imp___ZN4Vec3ixEj'
CMakeFiles\astro.dir/objects.a(astrolib.cpp.obj):astrolib.cpp:(.text+0xc510): undefined reference to `_imp___ZN4Vec36assignEddd'
CMakeFiles\astro.dir/objects.a(astrolib.cpp.obj):astrolib.cpp:(.text+0xc561): undefined reference to `_imp___ZN4Vec3aSERKS_'
CMakeFiles\astro.dir/objects.a(astrolib.cpp.obj):astrolib.cpp:(.text+0xc8c0): undefined reference to `_imp___ZN4Vec3ixEj'
CMakeFiles\astro.dir/objects.a(astrolib.cpp.obj):astrolib.cpp:(.text+0xc913): undefined reference to `_imp___ZN4Vec3aSERKS_'
CMakeFiles\astro.dir/objects.a(astrolib.cpp.obj):astrolib.cpp:(.text+0xca40): undefined reference to `_imp___ZN4Vec3ixEj'
CMakeFiles\astro.dir/objects.a(astrolib.cpp.obj):astrolib.cpp:(.text+0xca93): undefined reference to `_imp___ZN4Vec3aSERKS_'
CMakeFiles\astro.dir/objects.a(astrolib.cpp.obj):astrolib.cpp:(.text+0xcb9e): undefined reference to `_imp___ZN4Vec3C1Eddd'
CMakeFiles\astro.dir/objects.a(astrolib.cpp.obj):astrolib.cpp:(.text+0xcc36): undefined reference to `_imp___ZN4Mat3C1Ed'
CMakeFiles\astro.dir/objects.a(astrolib.cpp.obj):astrolib.cpp:(.text+0xcc45): undefined reference to `_imp___ZN4Vec3aSERKS_'
CMakeFiles\astro.dir/objects.a(astrolib.cpp.obj):astrolib.cpp:(.text+0xce15): undefined reference to `_imp___ZN4Mat3aSERKS_'
CMakeFiles\astro.dir/objects.a(astrolib.cpp.obj):astrolib.cpp:(.text+0xce4c): undefined reference to `_imp___ZN4Vec3mIERKS_'
CMakeFiles\astro.dir/objects.a(astrolib.cpp.obj):astrolib.cpp:(.text+0xcf35): undefined reference to `_imp___ZN4Vec3C1ERKS_'
CMakeFiles\astro.dir/objects.a(astrolib.cpp.obj):astrolib.cpp:(.text+0xcf65): undefined reference to `_imp___ZN4Vec3C1ERKS_'
CMakeFiles\astro.dir/objects.a(astrolib.cpp.obj):astrolib.cpp:(.text+0xcf9c): undefined reference to `_imp___ZN4Vec3C1Eddd'
C:/Qt/Tools/mingw491_32/bin/../lib/gcc/i686-w64-mingw32/4.9.1/../../../../i686-w
64-mingw32/bin/ld.exe: CMakeFiles\astro.dir/objects.a(astrolib.cpp.obj): bad rel
oc address 0x4 in section `.text.startup'
collect2.exe: error: ld returned 1 exit status
src\lib\astro\CMakeFiles\astro.dir\build.make:258: recipe for target 'src/lib/as
tro/libastro.dll' failed
mingw32-make[2]: *** [src/lib/astro/libastro.dll] Error 1
CMakeFiles\Makefile2:1342: recipe for target 'src/lib/astro/CMakeFiles/astro.dir
/all' failed
mingw32-make[1]: *** [src/lib/astro/CMakeFiles/astro.dir/all] Error 2
makefile:159: recipe for target 'all' failed
mingw32-make: *** [all] Error 2
alanclifford
Registered Member
Posts
1
Karma
0

Re: Error building Marble files

Thu May 05, 2016 8:30 pm
Hi,

I am experiencing exactly the same issue as Rivera and have failed to solve it after hours of trying. Hopefully someone out there can help!

A
User avatar Earthwings
KDE Developer
Posts
172
Karma
1
OS

Re: Error building Marble files

Tue Jun 14, 2016 4:21 pm
This should be fixed in latest master. Make sure you have https://phabricator.kde.org/rMARBLEe642 ... bd0a2ec4c3

 
Reply to topic

Bookmarks



Who is online

Registered users: Baidu [Spider], Bing [Bot], boudewijn, chris-on-neon, claydoh, Don B. Cilly, farid, funkyskywalker, Google [Bot], irvingarrietavazquez, jbouter, jeffgila, jmacleod, kde-jriddell, koffeinfriedhof, plistov, richmaxw, sh-zam, Sogou [Bot], srgmro33