Reply to topic

kdebase is not compiling anymore

hartwigj
Registered Member
Posts
12
Karma
0
OS

kdebase is not compiling anymore

Mon Jan 26, 2009 6:07 pm
Hi guys.

I hope you can help me.
kdebase won't compile anymore. This is since about one week.
I can update any package except kdebase.

Below you can see, what cmake says...
Usually it already stops when saying "Warte auf noch nicht beendete Prozesse".

Thanks

Scanning dependencies of target systemsettings
/home/kde-devel/qt-copy/include/QtCore/qhash.h: In member function »typename QHash::Node** QHash::findNode(const Key&, uint*) const [with Key = QUrl, T = Soprano::Node]«:
/home/kde-devel/qt-copy/include/QtCore/qhash.h:719: instantiated from »T& QHash::operator[](const Key&) [with Key = QUrl, T = Soprano::Node]«
/home/kde-devel/kde/src/KDE/kdebase/workspace/libs/nepomukquery/result.cpp:87: instantiated from here
/home/kde-devel/qt-copy/include/QtCore/qhash.h:854: Fehler: keine passende Funktion für Aufruf von »qHash(const QUrl&)«
/home/kde-devel/qt-copy/include/QtCore/qhash.h:59: Anmerkung: Kandidaten sind: uint qHash(char)
/home/kde-devel/qt-copy/include/QtCore/qhash.h:60: Anmerkung: uint qHash(uchar)
/home/kde-devel/qt-copy/include/QtCore/qhash.h:61: Anmerkung: uint qHash(signed char)
/home/kde-devel/qt-copy/include/QtCore/qhash.h:62: Anmerkung: uint qHash(ushort)
/home/kde-devel/qt-copy/include/QtCore/qhash.h:63: Anmerkung: uint qHash(short int)
/home/kde-devel/qt-copy/include/QtCore/qhash.h:64: Anmerkung: uint qHash(uint)
/home/kde-devel/qt-copy/include/QtCore/qhash.h:65: Anmerkung: uint qHash(int)
/home/kde-devel/qt-copy/include/QtCore/qhash.h:66: Anmerkung: uint qHash(ulong)
/home/kde-devel/qt-copy/include/QtCore/qhash.h:74: Anmerkung: uint qHash(long int)
/home/kde-devel/qt-copy/include/QtCore/qhash.h:75: Anmerkung: uint qHash(quint64)
/home/kde-devel/qt-copy/include/QtCore/qhash.h:83: Anmerkung: uint qHash(qint64)
/home/kde-devel/qt-copy/include/QtCore/qhash.h:84: Anmerkung: uint qHash(QChar)
/home/kde-devel/qt-copy/include/QtCore/qhash.h:85: Anmerkung: uint qHash(const QByteArray&)
/home/kde-devel/qt-copy/include/QtCore/qhash.h:86: Anmerkung: uint qHash(const QString&)
/home/kde-devel/qt-copy/include/QtCore/qhash.h:87: Anmerkung: uint qHash(const QStringRef&)
/home/kde-devel/qt-copy/include/QtCore/qhash.h:88: Anmerkung: uint qHash(const QBitArray&)
make[2]: *** [workspace/libs/nepomukquery/CMakeFiles/nepomukquery.dir/result.o] Fehler 1
make[1]: *** [workspace/libs/nepomukquery/CMakeFiles/nepomukquery.dir/all] Fehler 2
make[1]: *** Warte auf noch nicht beendete Prozesse...
[ 41%] [ 42%] Building CXX object workspace/systemsettings/CMakeFiles/systemsettings.dir/systemsettings_automoc.o
Building CXX object workspace/systemsettings/CMakeFiles/systemsettings.dir/kcmodulemodel.o
[ 42%] Building CXX object workspace/systemsettings/CMakeFiles/systemsettings.dir/kcmultiwidget.o
[ 42%] Building CXX object workspace/systemsettings/CMakeFiles/systemsettings.dir/main.o
[ 42%] Building CXX object workspace/systemsettings/CMakeFiles/systemsettings.dir/mainwindow.o
[ 42%] Building CXX object workspace/systemsettings/CMakeFiles/systemsettings.dir/menuitem.o
[ 42%] Building CXX object workspace/systemsettings/CMakeFiles/systemsettings.dir/moduleiconitem.o
Linking CXX executable systemsettings
[ 42%] Built target systemsettings
make: *** [all] Fehler 2
User avatar bcooksley
Administrator
Posts
19765
Karma
87
OS

RE: kdebase is not compiling anymore

Mon Jan 26, 2009 11:11 pm
Please ensure your copy of Qt is up to date. These are all QHash errors, so you must have a version of Qt that is different.


KDE Sysadmin
[img]http://forum.kde.org/content/bcooksley_sig.png[/img]

 
Reply to topic

Bookmarks



Who is online

Registered users: Baidu [Spider], Bing [Bot], Google [Bot], Graham Perrin, grumpfel, halla, howtokdenlive, PhobosK, radoeka, Yahoo [Bot]